Home

Nameerror: name 'codecs' is not defined

Fix: Bookmark not defined on Word - Appuals

NameError: name 'codecs' is not defined. Copy link Author bib0943 commented Jun 11, 2016. i whish to understand why if there are that's module on the code, i can't install it whit pip. plztell to us how fix it, step by step :) Copy link d4op commented Jun 12, 2016. hey i dont want to hijack this thread, but the current version of v3n0m hangs. Then look for a character which is not ASCII, e.g. ñ - this letter will be printed as some code, e.g.: 'espa\xc3\xb1ol' Above, ñ is represented as \xc3\xb1, because that is the utf-8 sequence for it. Now, you can check what various encodings would give and see which is right A NameError means that you've tried to use a variable that does not yet exist. In this guide, we're going to talk about the nameerror name is not defined error and why it is raised. We'll walk through a few example solutions to this error to help you understand how to resolve it in your code. What is a NameError Python executes that directly. If its left out it will execute all the code from the 0th level of indention. is wrong. Python executes everything directly from 0th level indentation, when importing a module, the __name__ is set to the module name, when running the python code as a script using python <sript>.py __name__ is set to __main__. - Anand S Kumar Aug 12 '15 at 5:4

pip install signal, codecs, itertools problem · Issue #39

  1. taking a course at the moment which I why do follow examples, but getting the following Name error: name 'name' not defined. from flask import Flask from flask_sqlalchemy import SQLAlchemy app = Flask(__name__) app.config['SQLALCHEMY_DATABASE_URI'].
  2. For example, UTF-16 is defined in such a way that 0xFFFE and 0xFEFF are not valid characters, and can be used to indicate the byte order. codecs defines constants for the byte order markers used by UTF-16 and UTF-32
  3. The Error means you are using a name that you have not already defined. Without seeing your code it is impossible to tell you exactly what the problem is, but a simple code example that generates the error
  4. NameError: name 'xx' is not defined Python knows the purposes of certain names (ex. built-in functions ). Other names are defined within the program (ex. variables)
  5. Python2.6-Python3.6Error1:TypeError: qRegisterResourceData(int, str,str, str): argument 2 has unexpected type 'str'设置pyrrc的外部工具:重新对qrc生成py文件。Error2:NameError: name 'codecs' is not defined将 import code..

Python codecs encoding not working - Stack Overflo

Python 3.4 Windows 7 Metadata-Version: 2.0 Name: scikit-learn Version: 0.16.1 Trying to use labelEncoder() to label mulltiple classes. But, when using le.transform('something'), often the wrong values are received. Thouhgt that it maybe. NameError: name 'DUMMY_INPUTS' is not defined - From TF to PyTorch #1810. Closed 202 203 if tf_inputs is not None: NameError: name 'DUMMY_INPUTS' is not defined UnicodeDecodeError: 'utf-8' codec can't decode byte 0x89 in position 0: invalid start byte. NameError: name 'codecs' is not defined となります。 キャンセル codecs を使われたとのことですが import codecs.

Jack Falahee from Stars Not Defined by Their Sexuality | E

NameError: name '__pyarmor__' is not defined¶ No Bootstrap Code are executed before importing obfuscated scripts. When creating new process by Popen or Process in mod subprocess or multiprocessing, to be sure that Bootstrap Code will be called before importing any obfuscated code in sub-process. Otherwise it will raise this exception Ok, importing a package gugu containing a single file __init__.py whose only content are 8 bytes - __file__ works fine.. But as I said above, I am not really sure that package actually gets 'frozen' as referred to in Python documentation. I can see that its gugu/__init__.pyc file gets stored in a library.zip archive constructed by cx_Freeze while importlib/__init__.pyc does not Trac: 1.2.2: Babel: 2.5.1: Docutils: 0.14: Genshi: 0.6 (without speedups) mod_wsgi: 3.5 (WSGIProcessGroup wsgi-trac WSGIApplicationGroup %{GLOBAL}) MySQL: server: 10. CSDN问答为您找到NameError: name 'parser' is not defined相关问题答案,如果想了解更多关于NameError: name 'parser' is not defined技术问题等相关问答,请访问CSDN问答

df.columns の表示に u が着いてるのはよくわかりませんが、 文字列の型が str なのは納得ですね。. codecs & pandas with read_table. では codecs を使って read_table で読み込むと >>> df = pd. read_table (codecs. open (sample.tsv, r, utf-8)) >>> df ID 言語 0 1 日本語 1 2 英語 >>> df [u 言語] Traceback (most recent call last):.. Hello everyone, I am trying to perform a propensity score matching using SPSS 27.0. In my extension hub, it shows me that FUZZY extension and PSM is installed

Python nameerror name is not defined Solution Career Karm

NameError: name 'webdriver' is not defined; Invalid depfil; NameError: name 'ggt' is not defined; The RazorTagHelper task failed unexpectedly. TypeError: index() missing 1 required positional argument: 'doc_type' lombok builder is not public; RuntimeError: Failed to process string with tex because latex could not be found; how to handle. 前提・実現したいこと BMI値の表示 ここに質問の内容を詳しく書いてください。 入門書に書かれているコードを書きました。 ターミナル上で実行したところエラーが出ました。 発生している問題・エラーメッセージ File bmi.py, line 1, in <module> while true: NameError: name 'true' is not de.. 5xiaowu的博客 Python Django NameError: name 'os' is not defined Python Django创建新项目settings文件中缺少OS模块 初学Django时,使用django3.1.2创建新项目总是报错NameError: name 'os' is not defined,如下图: 红色框线内释义为:OS模块没有定义 **解决办法:**在settings.py文件中导入os.

codecs — Codec registry and base classes, The stateless encoding and decoding functions. These must be functions or methods which have the same interface as the encode() and decode() methods of The Python string is not one of those things, and in fact it is probably what changed most drastically. NameError: name 'unicode' is not defined. CSDN问答为您找到[Python] [Linux]NameError: name 'PortHandler' is not defined相关问题答案,如果想了解更多关于[Python] [Linux]NameError: name 'PortHandler' is not defined技术问题等相关问答,请访问CSDN问答 CSDN问答为您找到NameError: global name 'rconfig' is not defined相关问题答案,如果想了解更多关于NameError: global name 'rconfig' is not defined技术问题等相关问答,请访问CSDN问答。 'ascii' codec can't encode character '**' in position 32怎么解决?. 0. Convert string to unicode - NameError: name 'unicode' is not defined. 0. Where is the `unicode` class located in Python? 255. NameError: name 'unicode' is not defined · Issue #24 · LightTable , NameError: name 'unicode' is not defined. During handling of the above exception, another exception occurred: Traceback (most recent call if type(s.

python - NameError: name '_name_' is not defined - Stack

YYC's issue is not my scripting -- he's working with international characters in the path names, which are way out of my expertise!! The YEUD field is an integer (in the international language of IEEE representations) so there is not a problem there The official dedicated python forum. Enter your details to to your account Use the following line to import the module. from importlib import reload. In Python 2, this was in build but in python, you've to use importlib Hello, I code a macro to export my projects more easily in FreeCAd V0.16 and V0.17. I'm having an encoding problem with the FreeCAD.ActiveDocument.saveAs () output stream Bootstrapping pip By Default¶. The new ensurepip module (defined in PEP 453) provides a standard cross-platform mechanism to bootstrap the pip installer into Python installations and virtual environments.The version of pip included with Python 3.4.0 is pip 1.5.4, and future 3.4.x maintenance releases will update the bundled version to the latest version of pip that is available at the time of.

name - name of the user-defined function in SQL statements. f - a Python function, or a user-defined function. The user-defined function can be either row-at-a-time or vectorized. See pyspark.sql.functions.udf() and pyspark.sql.functions.pandas_udf(). returnType - the return type of the registered user-defined function python charmap codec can't decode byte X in position Y character maps to < undefined> owais: 9: 29,285: Apr-28-2018, 10:52 PM Last Post: abadawi : timestamp not updating: bowen73: 3: 4,011: Aug-20-2017, 11:13 PM Last Post: bowen7 Technical Detail: If you're transitioning from Python 2 and are familiar with its function of the same name, you should be aware of a couple important changes in Python 3: Python 3's sorted() does not have a cmp parameter. Instead, only key is used to introduce custom sorting logic.; key and reverse must be passed as keyword arguments, unlike in Python 2, where they could be passed as. Oh no! Some styles failed to load. Please try reloading this page Help Create Join Login. Open Source Software. Accounting; CRM; Business Intelligenc It is not meant to be directly inherited by user-defined classes (for that, use Exception). If str() is called on an instance of this class, the representation of the argument(s) to the instance are returned, or the empty string when there were no arguments

Inserting a variable in MongoDB specifying _id field. python,mongodb,pymongo. Insert only accepts a final document or an array of documents, and an optional object which contains additional options for the collection. db.collection.insert( <document or array of documents>, { // options writeConcern: <document>, ordered: <boolean> } ) You may want to add the _id to the document in advance, but.. >>> from math import pi >>> pi 3.141592653589793 >>> math. pi NameError: name 'math' is not defined Note that this places pi in the global namespace and not within a math namespace. You can also rename modules and attributes as they're imported This does not introduce the module name from which the imports are taken in the local symbol table. It's possible but not recommended to import all names defined in a module, except those beginning with an underscore _

Earlier versions of setuptools implemented the attr: directive by importing the module, but setuptools 46.4.0 added rudimentary AST analysis so that attr: can function without having to import any of the package's dependencies.. Also, please be aware that declarative config indicators, including the attr: directive, are not supported in parameters to setup.py Face Detection+recognition: This is a simple example of running face detection and recognition with OpenCV from a camera. NOTE: I MADE THIS PROJECT FOR SENSOR CONTEST AND I USED CAMERA AS A SENSOR TO TRACK AND RECOGNITION FACES.So, Our GoalIn this session, 1. Install Anaconda import os, codecs: import tableaudocumentapi: import tableauserverclient as TSC: TABLEAU_SERVER = http/mytableau_server.com TABLEAU_SITE_ID = Default TABLEAU_USER = mytableauuser TABLEAU_PASSWORD = mytableaupassword NameError: name 'download_dir' is not defined. C:\python\Scripts> Please guide. Is it due to the fact that I had to. NameError: name 'test_word' is not defined と出力されます。 もし原因がわかる方やもっとこうしたらいいのに、というご意見がある方は、 何卒、ご教授宜しくお願い致します NameError: name 'x' is not defined. Python plante en annonçant que la variable n'est pas définie. Vous allez à la ligne donnée, et elle est là. Vous vérifiez qu'il n'y a pas de faute de frappe (genre un zéro mélangé avec la lettre O), ni une majuscule ou une minuscule échangée quelque part (Python est sensible à la casse). Et.

# NameError: name 'cmds' is not defined # This should work but I don't understand why my userSetup.py is not being read in correctly. However, if I type in the script editor import maya.cmds as cmds cmds.sphere() there is no problem and that works fine The official dedicated python forum. (Apr-16-2017, 01:49 PM) Ofnuts Wrote: In Linux if you want to use Python v3 the name of the command is python3.The python command is always Python v2. Not always. Like Arch Linux is a continuous release and python is python3.x, where you have to specify python2 to call python2.x This did not work in Python 3. However, the program turned out to work with: ocd[i].namn=a[:b] I don't remember why I put unicode there in the first place, but I think it was because the name can contains Swedish letters åäöÅÄÖ. But even they work without unicode. Hope this helps Python answers related to NameError: name 'StringIO' is not defined app = Flask(_name_) NameError: name '_name_' is not defined; builtins.NameError: name 'image' is not defined; django if self.pattern.name is not None and : in self.pattern.name: TypeError: argument of type 'function' is not iterable; ImportError: cannot import name.

So .h264 video that I have is NAL stream and doesn't have the information that's why maybe OpenCv is not able to return it. One method is to wrap .h264 in a container like .mp4 and then count the number of frames of the wrapped video. get(7) returns the total frame in that case 1.6 Q: NameError: name 'runfile' is not defined. Can you help? 1.7 Q: 'ascii' codec can't decode byte 0xb2 in position 20: ordinal not in range(128) What cause this error

NameError :name 'name' is not defined - Python Foru

NameError: name 'QVariant' is not defined This same code will work in the python console in QGIS. So, I don't have an idea as to why it won't work in the plugin that I am making NameError: name 'modules_list' is not defined 问题.png 修改一个叫做sitecustomize.py文件,我的这个文件的位置在C:\python3\Lib\site-packages下,将名字修改为sitecustomize_back.p NameError: name 'codecs' is not defined. 将 import codecs 删除。 Error3 : TypeError: an integer is required (got typestr) 将 open 的第三个参数删除。 Error4: NameError: name 'unicode' is not defined. Unicode 修改为 str 。 Error5: AttributeError: 'str' object has noattribute 'trimmed' 将.trimmed 直接去掉即可。 Error6 Get code examples like NameError: name . Python answers related to NameError: name 'inspect' is not defined builtins.NameError: name 'image' is not defined NameError: name 'xlCenter' is not defined Yep, since you have no name 'xlCenter' bound to anything. sh2.Columns(lastcol).HorizontalAlignment = constant.xlCenter Traceback (most recent call last): File <interactive input>, line 1, in ? NameError: name 'constant' is not defined Yep, since you have no name 'constant' bound to anything

Reading the html file using codecs; We will create a .py file and name it as app.py and place in the code below. NameError: name 'html_temp' is not defined. Process finished with exit code 1. Reply. jesse_jcharis. March 17, 2021 at 12:53 pm. It looks like you are missing the html_temp variable 12.3s 17 NameError: name 'df1' is not defined 12.3s 18. 13.4s 19 [NbConvertApp] Converting notebook __notebook__.ipynb to notebook 13.6s 20 [NbConvertApp] Writing 28587 bytes to __notebook__.ipynb UnicodeDecodeError: 'utf-8' codec can't decode byte 0xda in position 90:. @sl1pkn07 Thanks for the tip, I have updated the package to use Python 3.x : Pastebin.com is the number one paste tool since 2002. Pastebin is a website where you can store text online for a set period of time Python JSON: NameError: name 'false' is not defined, Python JSON: NameError: name 'false' is not defined, You are trying to paste the string straight into Python. Don't do that, it is a string sequence that represents Python's boolean constants are capitalized: True and False with upper case T and F respectively

codecs - String encoding and decoding - Python Module of

I found a script for loading several csv files into QGIS and modified it for .xyz Data. Yesterday on one Computer it worked and today on a different Computer it's not working anymore. Is ther NameError: name 'signal' is not defined というエラーを解消したいです。 参考サイト 上記のサイトを参考に「音声信号」項までは下記のコードで動作させることができました。 #c pyspark : NameError: name 'spark' is not defined This is because there is no default in Python program pyspark.sql.session . sparksession , so we just need to import the relevant modules and then convert them to sparksession

As for hardcoding indices in your script for the metadata, I would avoid doing this. I am not certain if ArcGIS will add future elements to the metadata, but if anything does get added/deleted, it could definitely mess up the indices in your current structure. It is best to get at the elements by name NameError: name 'reload' is not defined 在前面加入命令(个人推荐直接写在mian函数里面简单快捷) from imp import reload 四. 朴素贝叶斯. 报错: UnicodeDecodeError: 'gbk' codec can't decode byte 0xae in position 199: illegal multibyte sequence 那是因为书上的下面这两行代码有点问题 File <string>, line 2 SyntaxError: (unicode error) 'unicodeescape' codec can't decode bytes in position 2-3: truncated \UXXXXXXXX escape Categories Scripting , PYTHON Post navigation 35 Important Chef Interview Questions and Answers for DevOps Professional > NameError: name 'a' is not defined > >>> a = 0/1 or 100 > >>> a > 100 > >>> Thank you Lele, i wanted to but i had no idea how to test it. Your devision by zero is very smart thing to test! So it proves that a condition cannot be evaluation as truthy or false

How to solve the problem of 'NameError' not a defined name

str(a) Traceback (most recent call last): File <stdin>, line 1, in <module> UnicodeEncodeError: 'ascii' codec can't encode character u'\xe0' in position 4: ordinal not in range(128) Oh dip, that's not gonna do anyone any good! To fix the error, encode the bytes explicitly with .encode and tell python what codec to use Python env. GitHub Gist: instantly share code, notes, and snippets

Python error NameError name sr is not defined Edureka

VOC数据集验证. GitHub Gist: instantly share code, notes, and snippets I found a script for loading several csv files into QGIS and modified it for .xyz Data. Yesterday on one Computer it worked and today on a different Computer it's not working anymore. Is ther

March 14 2014 At Hacker School, I've been building an alternate universe Python by overwriting builtin functions and statements with Harry Potter spells.This is a thing you can do at Hacker School! Although this project started as a joke, I've quickly descended so deeply into Python internals that I've, with the guidance of the fabulous Hacker School facilitator Allison Kaptur, made edits to. Propensity Score Matching - FUZZY not found. I am using SPSS version 23 though I must access it over a network at work. I have a dataset with cases and controls that are indicated via variable called.. 4.1s 2 Traceback (most recent call last): File./src/script.py, line 37, in <module> reload(sys) NameError: name 'reload' is not defined 4.1s 3 4.1s 5 Failed For example, when you are not sure whether the input will be an integer or a float for arithmetic calculations or not sure about the existence of a file while trying to open it. import timeit setup=a=0 stmt1 = '''\ try: b=10/a except ZeroDivisionError: pass''

I just wasted 4 hours while trying to resolve this issue. I uninstalled, installed tried alot of things but this is not getting resolved. This is seriously so irritating. Does anyone know any solution? It is also so distracting while trying to code. If I cannot solve this one I guess I will just jump to NetBeans. thank 最近在使用python过重遇到这个问题,NameError: name 'xxx' is not defined,在学习python或者在使用python的过程中这个问题大家肯定都遇到过,在这里我就这个问题总结以下几种情况: 错误NameError: name 'xxx' is not defined总结. 情况一:要加双引号( )或者(' ')而没 Hi all I'm working with version 4657, running on Backtrack 5: w3af>>> version w3af - Web Application Attack and Audit Framework Version: 1.2 Revision: 4657 Author: Andres Riancho and the w3af team

InternalError (see above for traceback): Blas SGEMM launch failed : m=43264, n=32, k=64 [[Node: conv2d_3/convolution = Conv2D[T=DT_FLOAT, _class=[loc:@batch. print(myText.encode('utf-8', errors='ignore')) hhh Apr 15 '19 at 21:48 - @hhh I ran your snippet NameError: name 'myText' is not defined KHAN irfan Apr 20 '19 at 10:31 14 - Try to set in the shell, before executing your script: PYTHONIOENCODING $ export PYTHONIOENCODING=utf8 Noam Manos Aug 11 '19 at 8:50 30 Answers Active Oldest 1439 You. These no file created problems seem to be troubles with the >>> > codecs in (at least) the latest version of Ubuntu and maybe other >>> > distros as >>> > well. >>> > In particular, the ffmpeg converter app has been gelded -- it doesn't >>> > have >>> > AAC audio encoding anymore, which is required for MP4 file creation. >>> > I'll >>> > look.

Excuse me for the last post. The problem was between Doublecad et Blender. Not problem of scale now. For this NameError: name 'CXLine' is not defined error, i have found the solution; Blender don't accept blocks in autocad's files now. I had exploded the symbol and then no more problem. Byby Spirou4 Python NameError: name 'self' is not defined Solution. Aug 17, 2020. Comments (0) Leave a Reply Cancel reply. Your email address will not be published. Required fields are marked * Your Comment. Name * Email * Website. Get offers from top bootcamps. Take the stress out of picking a bootcamp UnicodeDecodeError: 'gbk' codec can't decode byte 0x99 in position 5357: illegal multibyte sequence... This comment has been minimized. Sign in to view. Copy link Quote reply (MRPC_TRAIN, mrpc_train_file) NameError: name 'URLLIB' is not defined. Examples in the wild • Seattle's peer-to-peer computing network • Google App Engine's Python shell • Codecademy's empythoned • CheckIO.org's online coding gam While executing the code from the book: In [3]: data = {i : randn() for i in range(7)} I got the following error: NameError: global name 'randn' is not defined. I solved it by using from scipy import randn. (Perhaps included packages depend on ipython configuration.) Note from the Author or Editor

>>> UnicodeEncodeError: 'charmap' codec can't encode character '\xa9' in >>> position 1650: character maps to <undefined> >> >>> The file is defined as ASCII. >> >> That's the problem: ASCII is a seven bit code. What you have is >> actually ISO-8859-1 (or possibly Windows-1252). >> >> The different ISO-8859-n variants assign various characters t Conclusion¶. This concludes your starter analysis! To go forward from here, click the blue Edit Notebook button at the top of the kernel. This will create a copy of the code and environment for you to edit

I am not certain how to connect the author id to an authors name, however (our team is small, so I just dive back into Guide and can link author id with a name). We can brainstorm on this one if you have a giant team. Lastly, you asked about extracting all Draft articles owned by a particular author Other text files use the policy described above for binary files. encoding is the name of the encoding used to decode or encode the file. This should only be used in text mode. The default encoding is platform dependent, but any encoding supported by Python can be passed. See the codecs module for the list of supported encodings NameError: global name 'mlt' is not defined ——————————————————-Error: OpenShot has not been installed in the Python path. (Both the site-packages and /usr/share/openshot folders were checked) Use the following command to install OpenShot: $ sudo python setup.py install —<snip>— The latter command doesn't. tokenize() determines the source encoding of the file by looking for a UTF-8 BOM or encoding cookie, according to PEP 263. tokenize.generate_tokens (readline) ¶ Tokenize a source reading unicode strings instead of bytes. Like tokenize(), the readline argument is a callable returning a single line of input. However, generate_tokens() expects readline to return a str object rather than bytes

NameError: name 'ipython' is not defined のようにエラーになります。 >>> と (base) PS C:\Users\jrppj> との違いはなんでしょうか。 常に(base) PS C:\Users\jrppj> にすることは出来ますでしょうか。 何度もお手数をおかけしますが、ご回答お願いいたします > UnicodeEncodeError: 'charmap' codec can't encode character '\xa9' in > position 1650: character maps to <undefined> > > The file is defined as ASCII. That's the problem: ASCII is a seven bit code. What you have is actually ISO-8859-1 (or possibly Windows-1252). The different ISO-8859-n variants assign various characters to to '\xa9' When the name variable is of the form package.module, normally, the top-level package (the name up till the first dot) is returned, not the module named by name. However, when a non-empty fromlist argument is given, the module named by name is returned. For example, the statement import spam results in bytecode resembling the following code I'm aware of the question posted here but my 120 csv files representing UK postcode centroids do not have x and y headers and dive straight into eastings and northings. Please see the code below which assumes coordinates are defined by columns 'x' and 'y'

Howdy y'all. I'm 30 years old and for the past six years I've dedicated my life to retail. I do enjoy working but at this point I can't see how I'd be able to continue living making only $32,000 a year The problem I run into here is that I get a NameError: name 'exp' is not defined. I am sorry if this is a bit too long I just wanted to give as much information as possible, but I truly appreciate your help. Best, FlintMarc

Microsoft Visual Basic Compile error: Sub or Function notDefining FamilyDefinition Of Tragedy And Play By Aristotle And Dryden
  • What is the solution of improper food sanitation.
  • Best palm sander.
  • Cheap rebuilt Alternators near me.
  • Total suspended solids procedure.
  • TalkHelper Call Recorder for Skype.
  • Fix bricked Wii without NAND files.
  • Spider Solitaire winnable games.
  • UPS cold shipping.
  • Satisfaction meaning in tagalog.
  • The Legend of Korra season 1.
  • Numbers in welsh 1 20.
  • Registry Editor Windows 7.
  • Entry level Full Stack Web Developer salary.
  • Facebook gifting Group Games.
  • African Pygmy hedgehogs for sale.
  • Dining Room Sets with Bench.
  • Belkin F9K1102v3 firmware.
  • What is the Colosseum made of.
  • How big does your overbite have to be to get braces.
  • When I cut myself I don t bleed.
  • Green Tree frog habitat setup.
  • Subway breakfast menu UK.
  • MOI accident history check.
  • Cartier love bracelet size 17 or 18.
  • Carburetor vs fuel injection pros cons motorcycle.
  • Pest control certification test.
  • Wet tumbling brass simple green.
  • H and R block appointment.
  • Diluted EPS questions.
  • What are mercury switches used for.
  • SC DEW.
  • Private lenders Near me.
  • Steering bushings symptoms.
  • Impact of hospitality industry on global economy.
  • How do you endorse a check made out to Mr and Mrs.
  • ALDC LA.
  • Frayed review Rotten Tomatoes.
  • BIOS copy Tool.
  • Television writers Assistant jobs NYC.
  • Starbucks Vanilla syrup ingredients.
  • Best software to burn iMovie to DVD.